Target
Egl nine homolog 1
Ligand
BDBM50317247
Substrate
Meas. Tech.
ChEBML_1733850
IC50
13700±n/a nM
Citation
 Joharapurkar, AAPandya, VBPatel, VJDesai, RCJain, MR Prolyl Hydroxylase Inhibitors: A Breakthrough in the Therapy of Anemia Associated with Chronic Diseases. J Med Chem 61:6964-6982 (2018)  
Target
Name:
Egl nine homolog 1
Synonyms:
C1orf12 EGLN1_HUMAN Hypoxia-inducible factor prolyl hydroxylase 2 (HIF-PH2) Prolyl hydroxylase domain-containing protein 2 (PHD2)
Type:
Protein
Mol. Mass.:
46035.59
Organism:
Homo sapiens (Human)
Description:
Q9GZT9
Residue:
426
  
Inhibitor
Name:
BDBM50317247
Synonyms:
CHEMBL4173461
Type:
Small organic molecule
Emp. Form.:
C14H11FN2O4
Mol. Mass.:
290.2465
SMILES:
OC(=O)CNC(=O)c1ncc(cc1O)-c1cccc(F)c1
: