Target
Egl nine homolog 1
Ligand
BDBM50317465
Substrate
Meas. Tech.
ChEMBL_1733858 (CHEMBL4149394)
IC50
1.8±n/a nM
Citation
 Joharapurkar, AAPandya, VBPatel, VJDesai, RCJain, MR Prolyl Hydroxylase Inhibitors: A Breakthrough in the Therapy of Anemia Associated with Chronic Diseases. J Med Chem 61:6964-6982 (2018)  
Target
Name:
Egl nine homolog 1
Synonyms:
C1orf12 EGLN1_HUMAN Hypoxia-inducible factor prolyl hydroxylase 2 (HIF-PH2) Prolyl hydroxylase domain-containing protein 2 (PHD2)
Type:
Protein
Mol. Mass.:
46035.59
Organism:
Homo sapiens (Human)
Description:
Q9GZT9
Residue:
426
  
Inhibitor
Name:
BDBM50317465
Synonyms:
CHEMBL4165865
Type:
Small organic molecule
Emp. Form.:
C15H11N3O6
Mol. Mass.:
329.2643
SMILES:
OC(=O)CNC(=O)c1c(O)c2cc(cc3OCCn(c23)c1=O)C#N
: