Target
Egl nine homolog 1
Ligand
BDBM350280
Substrate
Meas. Tech.
ChEMBL_1733858 (CHEMBL4149394)
IC50
4.1±n/a nM
Citation
 Joharapurkar, AAPandya, VBPatel, VJDesai, RCJain, MR Prolyl Hydroxylase Inhibitors: A Breakthrough in the Therapy of Anemia Associated with Chronic Diseases. J Med Chem 61:6964-6982 (2018)  
Target
Name:
Egl nine homolog 1
Synonyms:
C1orf12 EGLN1_HUMAN Hypoxia-inducible factor prolyl hydroxylase 2 (HIF-PH2) Prolyl hydroxylase domain-containing protein 2 (PHD2)
Type:
Protein
Mol. Mass.:
46035.59
Organism:
Homo sapiens (Human)
Description:
Q9GZT9
Residue:
426
  
Inhibitor
Name:
BDBM350280
Synonyms:
2-(4-Hydroxy-2-oxo-1-(3'- (trifluoromethoxy)-[1,1'- biphenyl]-4-yl)-1,2,5,7- tetrahydrothieno[3,4-b] pyridine-3-arboxamido) acetic acid | US10208060, Example 13
Type:
Small organic molecule
Emp. Form.:
C23H17F3N2O6S
Mol. Mass.:
506.451
SMILES:
OC(=O)CNC(=O)c1c(O)c2CSCc2n(-c2ccc(cc2)-c2cccc(OC(F)(F)F)c2)c1=O
: