Target
Egl nine homolog 1
Ligand
BDBM50317546
Substrate
Meas. Tech.
ChEMBL_1733891 (CHEMBL4149427)
IC50
18400±n/a nM
Citation
 Joharapurkar, AAPandya, VBPatel, VJDesai, RCJain, MR Prolyl Hydroxylase Inhibitors: A Breakthrough in the Therapy of Anemia Associated with Chronic Diseases. J Med Chem 61:6964-6982 (2018)  
Target
Name:
Egl nine homolog 1
Synonyms:
C1orf12 EGLN1_HUMAN Hypoxia-inducible factor prolyl hydroxylase 2 (HIF-PH2) Prolyl hydroxylase domain-containing protein 2 (PHD2)
Type:
Protein
Mol. Mass.:
46035.59
Organism:
Homo sapiens (Human)
Description:
Q9GZT9
Residue:
426
  
Inhibitor
Name:
BDBM50317546
Synonyms:
CHEMBL4168832
Type:
Small organic molecule
Emp. Form.:
C14H13N3O4
Mol. Mass.:
287.2707
SMILES:
OC(=O)CCC(=O)NNC(=O)c1cc2ccccc2cn1
: