Target
Prolyl hydroxylase EGLN2
Ligand
BDBM50317547
Substrate
Meas. Tech.
ChEMBL_1733860 (CHEMBL4149396)
IC50
3.5±n/a nM
Citation
 Joharapurkar, AAPandya, VBPatel, VJDesai, RCJain, MR Prolyl Hydroxylase Inhibitors: A Breakthrough in the Therapy of Anemia Associated with Chronic Diseases. J Med Chem 61:6964-6982 (2018)  
Target
Name:
Prolyl hydroxylase EGLN2
Synonyms:
EGLN2 EIT6 Estrogen-induced tag 6 HIF-PH1 HPH-3 PHD1 Prolyl hydroxylase domain-containing protein 1 (PHD1)
Type:
Protein
Mol. Mass.:
43657.01
Organism:
Homo sapiens (Human)
Description:
Q96KS0
Residue:
407
  
Inhibitor
Name:
BDBM50317547
Synonyms:
CHEMBL4163812
Type:
Small organic molecule
Emp. Form.:
C19H27N3O6
Mol. Mass.:
393.4342
SMILES:
OC(=O)CNC(=O)c1c(O)n(C2CCCCC2)c(=O)n(C2CCCCC2)c1=O
: