Target
Egl nine homolog 1
Ligand
BDBM118339
Substrate
Meas. Tech.
ChEMBL_1733876 (CHEMBL4149412)
IC50
280±n/a nM
Citation
 Joharapurkar, AAPandya, VBPatel, VJDesai, RCJain, MR Prolyl Hydroxylase Inhibitors: A Breakthrough in the Therapy of Anemia Associated with Chronic Diseases. J Med Chem 61:6964-6982 (2018)  
Target
Name:
Egl nine homolog 1
Synonyms:
C1orf12 EGLN1_HUMAN Hypoxia-inducible factor prolyl hydroxylase 2 (HIF-PH2) Prolyl hydroxylase domain-containing protein 2 (PHD2)
Type:
Protein
Mol. Mass.:
46035.59
Organism:
Homo sapiens (Human)
Description:
Q9GZT9
Residue:
426
  
Inhibitor
Name:
BDBM118339
Synonyms:
US8653111, 72
Type:
Small organic molecule
Emp. Form.:
C13H14N8O2
Mol. Mass.:
314.3027
SMILES:
O=c1c(c[nH]n1-c1cc(ncn1)N1CCOCC1)-n1ccnn1
: