Target
Egl nine homolog 1
Ligand
BDBM50317078
Substrate
Meas. Tech.
ChEMBL_1733854 (CHEMBL4149390)
IC50
12±n/a nM
Citation
 Joharapurkar, AAPandya, VBPatel, VJDesai, RCJain, MR Prolyl Hydroxylase Inhibitors: A Breakthrough in the Therapy of Anemia Associated with Chronic Diseases. J Med Chem 61:6964-6982 (2018)  
Target
Name:
Egl nine homolog 1
Synonyms:
C1orf12 EGLN1_HUMAN Hypoxia-inducible factor prolyl hydroxylase 2 (HIF-PH2) Prolyl hydroxylase domain-containing protein 2 (PHD2)
Type:
Protein
Mol. Mass.:
46035.59
Organism:
Homo sapiens (Human)
Description:
Q9GZT9
Residue:
426
  
Inhibitor
Name:
BDBM50317078
Synonyms:
CHEMBL4170656
Type:
Small organic molecule
Emp. Form.:
C23H20N6O3
Mol. Mass.:
428.4433
SMILES:
CCc1ccc2cc(CCn3ncc4nc(nc(O)c34)-n3cc(cn3)C(O)=O)ccc2c1
: