Target
Egl nine homolog 1
Ligand
BDBM50318679
Substrate
Meas. Tech.
ChEBML_1733850
IC50
13700±n/a nM
Citation
 Joharapurkar, AAPandya, VBPatel, VJDesai, RCJain, MR Prolyl Hydroxylase Inhibitors: A Breakthrough in the Therapy of Anemia Associated with Chronic Diseases. J Med Chem 61:6964-6982 (2018)  
Target
Name:
Egl nine homolog 1
Synonyms:
C1orf12 EGLN1_HUMAN Hypoxia-inducible factor prolyl hydroxylase 2 (HIF-PH2) Prolyl hydroxylase domain-containing protein 2 (PHD2)
Type:
Protein
Mol. Mass.:
46035.59
Organism:
Homo sapiens (Human)
Description:
Q9GZT9
Residue:
426
  
Inhibitor
Name:
BDBM50318679
Synonyms:
CHEMBL4162752 | US10889546, Example 44
Type:
Small organic molecule
Emp. Form.:
C17H13ClN2O5
Mol. Mass.:
360.749
SMILES:
OC(=O)CNC(=O)c1ncc(cc1O)C#CCOc1ccc(Cl)cc1
: