Target
Prolyl hydroxylase EGLN2
Ligand
BDBM240926
Substrate
Meas. Tech.
ChEMBL_1733849 (CHEMBL4149385)
IC50
240±n/a nM
Citation
 Joharapurkar, AAPandya, VBPatel, VJDesai, RCJain, MR Prolyl Hydroxylase Inhibitors: A Breakthrough in the Therapy of Anemia Associated with Chronic Diseases. J Med Chem 61:6964-6982 (2018)  
Target
Name:
Prolyl hydroxylase EGLN2
Synonyms:
EGLN2 EIT6 Estrogen-induced tag 6 HIF-PH1 HPH-3 PHD1 Prolyl hydroxylase domain-containing protein 1 (PHD1)
Type:
Protein
Mol. Mass.:
43657.01
Organism:
Homo sapiens (Human)
Description:
Q96KS0
Residue:
407
  
Inhibitor
Name:
BDBM240926
Synonyms:
US9409892, 21
Type:
Small organic molecule
Emp. Form.:
C23H21N3O6
Mol. Mass.:
435.4293
SMILES:
COc1ccc(Oc2ccc3c(O)c(nc(C#N)c3c2)C(=O)NC(C)(C)CC(O)=O)cc1
: