Target
Egl nine homolog 1
Ligand
BDBM50321014
Substrate
Meas. Tech.
ChEMBL_1733857 (CHEMBL4149393)
IC50
<10±n/a nM
Citation
 Joharapurkar, AAPandya, VBPatel, VJDesai, RCJain, MR Prolyl Hydroxylase Inhibitors: A Breakthrough in the Therapy of Anemia Associated with Chronic Diseases. J Med Chem 61:6964-6982 (2018)  
Target
Name:
Egl nine homolog 1
Synonyms:
C1orf12 EGLN1_HUMAN Hypoxia-inducible factor prolyl hydroxylase 2 (HIF-PH2) Prolyl hydroxylase domain-containing protein 2 (PHD2)
Type:
Protein
Mol. Mass.:
46035.59
Organism:
Homo sapiens (Human)
Description:
Q9GZT9
Residue:
426
  
Inhibitor
Name:
BDBM50321014
Synonyms:
CHEMBL4163550
Type:
Small organic molecule
Emp. Form.:
C23H20N5O5P
Mol. Mass.:
477.4092
SMILES:
COc1ccc(cc1)C(NC(=O)c1cnc(nc1O)-c1cccnn1)c1ccc(cc1)P(O)=O
: