Target
Egl nine homolog 1
Ligand
BDBM50318681
Substrate
Meas. Tech.
ChEMBL_1733858 (CHEMBL4149394)
IC50
5.4±n/a nM
Citation
 Joharapurkar, AAPandya, VBPatel, VJDesai, RCJain, MR Prolyl Hydroxylase Inhibitors: A Breakthrough in the Therapy of Anemia Associated with Chronic Diseases. J Med Chem 61:6964-6982 (2018)  
Target
Name:
Egl nine homolog 1
Synonyms:
C1orf12 EGLN1_HUMAN Hypoxia-inducible factor prolyl hydroxylase 2 (HIF-PH2) Prolyl hydroxylase domain-containing protein 2 (PHD2)
Type:
Protein
Mol. Mass.:
46035.59
Organism:
Homo sapiens (Human)
Description:
Q9GZT9
Residue:
426
  
Inhibitor
Name:
BDBM50318681
Synonyms:
CHEMBL4162309
Type:
Small organic molecule
Emp. Form.:
C19H17N3O6S
Mol. Mass.:
415.42
SMILES:
OC(=O)CNC(=O)c1c(O)c2COCCc2n(Cc2nc3ccccc3s2)c1=O
: