Target
Neuromedin-U receptor 2
Ligand
BDBM50336022
Substrate
Meas. Tech.
ChEMBL_1734438 (CHEMBL4149974)
IC50
599±n/a nM
Citation
 De Prins, AMartin, CVan Wanseele, YTömböly, CTourwé, DCaveliers, VHolst, BVan Eeckhaut, ARosenkilde, MMSmolders, IBallet, S Synthesis and  ACS Med Chem Lett 9:496-501 (2018)  
Target
Name:
Neuromedin-U receptor 2
Synonyms:
G-protein coupled receptor FM-4 NMU-R2 NMU2R NMUR2_HUMAN TGR1
Type:
PROTEIN
Mol. Mass.:
47710.86
Organism:
Homo sapiens (Human)
Description:
ChEMBL_103075
Residue:
415
  
Inhibitor
Name:
BDBM50336022
Synonyms:
CHEMBL4171236
Type:
Small organic molecule
Emp. Form.:
C58H82N16O12
Mol. Mass.:
1195.3717
SMILES:
CC(C)C[C@H](NC(=O)[C@H](Cc1ccccc1)NC(=O)[C@@H]1Cc2ccc(O)cc2CN1C(C)=O)C(=O)N(CCc1ccc(O)cc1)CC(=O)N[C@@H](CCCNC(N)=N)C(=O)N1CCC[C@H]1C(=O)N[C@@H](CCCNC(N)=N)C(=O)N[C@@H](CC(N)=O)C(N)=O
: