Target
Bromodomain-containing protein 4
Ligand
BDBM179481
Substrate
Meas. Tech.
ChEMBL_1735456 (CHEMBL4150992)
IC50
28±n/a nM
Citation
 Zhao, YZhou, BBai, LLiu, LYang, CYMeagher, JLStuckey, JAMcEachern, DPrzybranowski, SWang, MRan, XAguilar, AHu, YKampf, JWLi, XZhao, TLi, SWen, BSun, DWang, S Structure-Based Discovery of CF53 as a Potent and Orally Bioavailable Bromodomain and Extra-Terminal (BET) Bromodomain Inhibitor. J Med Chem 61:6110-6120 (2018)  
Target
Name:
Bromodomain-containing protein 4
Synonyms:
BRD4 Bromodomain-containing protein 4 (BRD4) Protein HUNK1
Type:
Protein
Mol. Mass.:
152264.84
Organism:
Homo sapiens (Human)
Description:
O60885
Residue:
1362
  
Inhibitor
Name:
BDBM179481
Synonyms:
US9675697, Cpd. No. 73
Type:
Small organic molecule
Emp. Form.:
C26H21N5O2
Mol. Mass.:
435.4772
SMILES:
COc1cc2c(cc1-c1c(C)noc1C)[nH]c1nc(C)nc(-c3ccnc4ccccc34)c21
: