Target
Group 10 secretory phospholipase A2
Ligand
BDBM50366784
Substrate
Meas. Tech.
ChEMBL_1735583 (CHEMBL4151119)
IC50
96±n/a nM
Citation
 Knerr, LGiordanetto, FNordberg, PPettersen, DSelmi, NBeisel, HGde la Motte, HOlsson, TPerkins, TDJHerslöf, MMånsson, ÅDahlström, MStarke, IBroddefalk, JSaarinen, GKlingegård, FHurt-Camejo, ERosengren, BBrengdahl, JJansen, FRohman, MSandmark, JHallberg, KÅkerud, TRoth, RGAhlqvist, M Discovery of a Series of Indole-2 Carboxamides as Selective Secreted Phospholipase A ACS Med Chem Lett 9:594-599 (2018)  
Target
Name:
Group 10 secretory phospholipase A2
Synonyms:
Group X secretory phospholipase A2 Pla2g10
Type:
PROTEIN
Mol. Mass.:
17005.09
Organism:
Mus musculus
Description:
ChEMBL_537139
Residue:
151
  
Inhibitor
Name:
BDBM50366784
Synonyms:
CHEMBL4171084
Type:
Small organic molecule
Emp. Form.:
C19H15F3N2O4
Mol. Mass.:
392.3286
SMILES:
NC(=O)c1cc2ccc(OC(F)(F)F)cc2n1-c1cccc(CCC(O)=O)c1
: