Target
Group 10 secretory phospholipase A2
Ligand
BDBM50366983
Substrate
Meas. Tech.
ChEMBL_1735577 (CHEMBL4151113)
IC50
68±n/a nM
Citation
 Knerr, LGiordanetto, FNordberg, PPettersen, DSelmi, NBeisel, HGde la Motte, HOlsson, TPerkins, TDJHerslöf, MMånsson, ÅDahlström, MStarke, IBroddefalk, JSaarinen, GKlingegård, FHurt-Camejo, ERosengren, BBrengdahl, JJansen, FRohman, MSandmark, JHallberg, KÅkerud, TRoth, RGAhlqvist, M Discovery of a Series of Indole-2 Carboxamides as Selective Secreted Phospholipase A ACS Med Chem Lett 9:594-599 (2018)  
Target
Name:
Group 10 secretory phospholipase A2
Synonyms:
Group X secretory phospholipase A2 PLA2G10
Type:
PROTEIN
Mol. Mass.:
18153.11
Organism:
Homo sapiens (Human)
Description:
ChEMBL_1442449
Residue:
165
  
Inhibitor
Name:
BDBM50366983
Synonyms:
CHEMBL4160483
Type:
Small organic molecule
Emp. Form.:
C19H16F2N2O4
Mol. Mass.:
374.3381
SMILES:
NC(=O)c1cc2ccc(OC(F)F)cc2n1-c1cccc(CCC(O)=O)c1
: