Target
Free fatty acid receptor 1
Ligand
BDBM50367224
Substrate
Meas. Tech.
ChEMBL_1735722 (CHEMBL4151258)
EC50
934±n/a nM
Citation
 Chen, HYPlummer, CWXiao, DChobanian, HRDeMong, DMiller, MTrujillo, MEKirkland, MKosinski, DMane, JPachanski, MCheewatrakoolpong, BDi Salvo, JThomas-Fowlkes, BSouza, STatosian, DAChen, QHafey, MJHoule, RNolting, AFOrr, REhrhart, JWeinglass, ABTschirret-Guth, RHoward, ADColletti, SL Structure-Activity Relationship of Novel and Selective Biaryl-Chroman GPR40 AgoPAMs. ACS Med Chem Lett 9:685-690 (2018)  
Target
Name:
Free fatty acid receptor 1
Synonyms:
FFAR1 G-protein Coupled Receptor 40 | GPR40
Type:
G Protein-Coupled Receptor (GPCR)
Mol. Mass.:
31473.32
Organism:
Homo sapiens (Human)
Description:
O14842
Residue:
300
  
Inhibitor
Name:
BDBM50367224
Synonyms:
CHEMBL4163496
Type:
Small organic molecule
Emp. Form.:
C28H25F3O4
Mol. Mass.:
482.4909
SMILES:
OC(=O)C[C@@H](C1CC1)c1ccc2CCC(Oc2c1)c1ccc(cc1)-c1cccc(OC(F)(F)F)c1
: