Target
Free fatty acid receptor 1
Ligand
BDBM50367225
Substrate
Meas. Tech.
ChEMBL_1735723 (CHEMBL4151259)
EC50
757±n/a nM
Citation
 Chen, HYPlummer, CWXiao, DChobanian, HRDeMong, DMiller, MTrujillo, MEKirkland, MKosinski, DMane, JPachanski, MCheewatrakoolpong, BDi Salvo, JThomas-Fowlkes, BSouza, STatosian, DAChen, QHafey, MJHoule, RNolting, AFOrr, REhrhart, JWeinglass, ABTschirret-Guth, RHoward, ADColletti, SL Structure-Activity Relationship of Novel and Selective Biaryl-Chroman GPR40 AgoPAMs. ACS Med Chem Lett 9:685-690 (2018)  
Target
Name:
Free fatty acid receptor 1
Synonyms:
FFAR1 G-protein Coupled Receptor 40 | GPR40
Type:
G Protein-Coupled Receptor (GPCR)
Mol. Mass.:
31473.32
Organism:
Homo sapiens (Human)
Description:
O14842
Residue:
300
  
Inhibitor
Name:
BDBM50367225
Synonyms:
CHEMBL4165008
Type:
Small organic molecule
Emp. Form.:
C27H25F2N2NaO4
Mol. Mass.:
502.485
SMILES:
[Na;v0+].[#6]-[#8]-c1cc(c(F)cn1)-c1cnc(-[#6]-2-[#6]-[#6]-c3ccc(cc3-[#8]-2)-[#6@@H](-[#6@H](-[#6])-[#6](-[#8-])=O)-[#6]-2-[#6]-[#6]-2)c(F)c1
: