Target
Cyclin-dependent kinase 13/Cyclin-K
Ligand
BDBM2579
Substrate
Meas. Tech.
ChEMBL_1735961 (CHEMBL4151497)
IC50
57±n/a nM
Citation
 Ito, MTanaka, TToita, AUchiyama, NKokubo, HMorishita, NKlein, MGZou, HMurakami, MKondo, MSameshima, TAraki, SEndo, SKawamoto, TMorin, GBAparicio, SANakanishi, AMaezaki, HImaeda, Y Discovery of 3-Benzyl-1-( trans-4-((5-cyanopyridin-2-yl)amino)cyclohexyl)-1-arylurea Derivatives as Novel and Selective Cyclin-Dependent Kinase 12 (CDK12) Inhibitors. J Med Chem 61:7710-7728 (2018)  
Target
Name:
Cyclin-dependent kinase 13/Cyclin-K
Synonyms:
Cyclin-K/Cyclin-dependent kinase 13
Type:
Mol. Mass.:
Description:
ASSAY_ID of ChEMBL is 2192353
Components:
This complex has 2 components.
Component 1
Name:
Cyclin-dependent kinase 13
Synonyms:
CDC2-related protein kinase 5 CDC2L5 CDK13_HUMAN Cell division cycle 2-like protein kinase 5 Cholinesterase-related cell division controller hCDK13
Type:
PROTEIN
Mol. Mass.:
165002.38
Organism:
Homo sapiens (Human)
Description:
ChEMBL_774241
Residue:
1512
  
Component 2
Name:
Cyclin-K
Synonyms:
CCNK CPR4
Type:
PROTEIN
Mol. Mass.:
64254.10
Organism:
Homo sapiens (Human)
Description:
ChEMBL_107901
Residue:
580
  
Inhibitor
Name:
BDBM2579
Synonyms:
(2S,3R,4R,6R)-3-methoxy-2-methyl-4-(methylamino)-29-oxa-1,7,17-triazaoctacyclo[12.12.2.1^{2,6}.0^{7,28}.0^{8,13}.0^{15,19}.0^{20,27}.0^{21,26}]nonacosa-8(13),9,11,14(28),15(19),20(27),21(26),22,24-nonaen-16-one Staurosporin, 4 Staurosporine, 8 US9206188, Staurosporine | US9226923, Staurosporine
Type:
Small organic molecule
Emp. Form.:
C28H26N4O3
Mol. Mass.:
466.531
SMILES:
CN[C@@H]1C[C@H]2O[C@@](C)([C@@H]1OC)n1c3ccccc3c3c4CNC(=O)c4c4c5ccccc5n2c4c13
: