Target
Adenosine receptor A1
Ligand
BDBM50018151
Substrate
Meas. Tech.
ChEMBL_29620 (CHEMBL639642)
Ki
200±n/a nM
Citation
 Shamim, MTUkena, DPadgett, WLDaly, JW Effects of 8-phenyl and 8-cycloalkyl substituents on the activity of mono-, di-, and trisubstituted alkylxanthines with substitution at the 1-, 3-, and 7-positions. J Med Chem 32:1231-7 (1989)  
Target
Name:
Adenosine receptor A1
Synonyms:
AA1R_RAT ADENOSINE A1 high Adenosine A1 receptor (A1) Adenosine receptors A1 | Adora1
Type:
Protein
Mol. Mass.:
36704.13
Organism:
Rattus norvegicus (rat)
Description:
Residue:
326
  
Inhibitor
Name:
BDBM50018151
Synonyms:
4-(2,6-Dioxo-1,3-dipropyl-2,3,6,7-tetrahydro-1H-purin-8-yl)-benzoic acid CHEMBL423239
Type:
Small organic molecule
Emp. Form.:
C18H20N4O4
Mol. Mass.:
356.3758
SMILES:
CCCn1c2nc([nH]c2c(=O)n(CCC)c1=O)-c1ccc(cc1)C(O)=O
: