Target
Adenosine receptor A1
Ligand
BDBM50018170
Substrate
Meas. Tech.
ChEMBL_29620 (CHEMBL639642)
Ki
1200±n/a nM
Citation
 Shamim, MTUkena, DPadgett, WLDaly, JW Effects of 8-phenyl and 8-cycloalkyl substituents on the activity of mono-, di-, and trisubstituted alkylxanthines with substitution at the 1-, 3-, and 7-positions. J Med Chem 32:1231-7 (1989)  
Target
Name:
Adenosine receptor A1
Synonyms:
AA1R_RAT ADENOSINE A1 high Adenosine A1 receptor (A1) Adenosine receptors A1 | Adora1
Type:
Protein
Mol. Mass.:
36704.13
Organism:
Rattus norvegicus (rat)
Description:
Residue:
326
  
Inhibitor
Name:
BDBM50018170
Synonyms:
4-[3-Isobutyl-1-(3-methyl-butyl)-2,6-dioxo-2,3,6,7-tetrahydro-1H-purin-8-yl]-benzenesulfonic acid | CHEMBL279688
Type:
Small organic molecule
Emp. Form.:
C20H26N4O5S
Mol. Mass.:
434.509
SMILES:
CC(C)CCn1c(=O)n(CC(C)C)c2nc([nH]c2c1=O)-c1ccc(cc1)S(O)(=O)=O
: