Target
Adenosine receptor A1
Ligand
BDBM50001515
Substrate
Meas. Tech.
ChEMBL_29620 (CHEMBL639642)
Ki
35000±n/a nM
Citation
 Shamim, MTUkena, DPadgett, WLDaly, JW Effects of 8-phenyl and 8-cycloalkyl substituents on the activity of mono-, di-, and trisubstituted alkylxanthines with substitution at the 1-, 3-, and 7-positions. J Med Chem 32:1231-7 (1989)  
Target
Name:
Adenosine receptor A1
Synonyms:
AA1R_RAT ADENOSINE A1 high Adenosine A1 receptor (A1) Adenosine receptors A1 | Adora1
Type:
Protein
Mol. Mass.:
36704.13
Organism:
Rattus norvegicus (rat)
Description:
Residue:
326
  
Inhibitor
Name:
BDBM50001515
Synonyms:
1-Methylxanthine (1-Mx) 3-Methyl-3,9-dihydro-purine-2,6-dione(3-methyl xanthine) | CHEMBL619
Type:
Small organic molecule
Emp. Form.:
C6H6N4O2
Mol. Mass.:
166.1374
SMILES:
Cn1c2nc[nH]c2c(=O)[nH]c1=O
: