Target
Adenosine receptor A2a/A2b
Ligand
BDBM50014528
Substrate
Meas. Tech.
ChEMBL_27926 (CHEMBL642334)
Ki
150±n/a nM
Citation
 Shamim, MTUkena, DPadgett, WLDaly, JW Effects of 8-phenyl and 8-cycloalkyl substituents on the activity of mono-, di-, and trisubstituted alkylxanthines with substitution at the 1-, 3-, and 7-positions. J Med Chem 32:1231-7 (1989)  
Target
Name:
Adenosine receptor A2a/A2b
Synonyms:
Adenosine A2 receptor
Type:
Mol. Mass.:
Description:
ASSAY_ID of ChEMBL is 329906
Components:
This complex has 2 components.
Component 1
Name:
Adenosine receptor A2b
Synonyms:
AA2BR_HUMAN ADORA2B Adenosine receptors A2b | Adenosine receptors; A2a & A2b
Type:
G Protein-Coupled Receptor (GPCR)
Mol. Mass.:
36341.22
Organism:
Homo sapiens (Human)
Description:
Residue:
332
  
Component 2
Name:
Adenosine receptor A2a
Synonyms:
A2A adenosine receptor (hA2A) ADENOSINE A2 ADORA2 Adenosine A2A receptor (A2AAR)
Type:
G Protein-Coupled Receptor (GPCR)
Mol. Mass.:
44716.46
Organism:
Homo sapiens (Human)
Description:
P29274
Residue:
412
  
Inhibitor
Name:
BDBM50014528
Synonyms:
8-Cyclohexyl-1,1,3-trimethyl-3,9-dihydro-purine-2,6-dione(Cyclohexyl Theophylline) CHEMBL321505
Type:
Small organic molecule
Emp. Form.:
C13H18N4O2
Mol. Mass.:
262.3076
SMILES:
Cn1c2nc([nH]c2c(=O)n(C)c1=O)C1CCCCC1
: