Target
Estrogen receptor
Ligand
BDBM50368804
Substrate
Meas. Tech.
ChEMBL_1736208 (CHEMBL4151744)
IC50
0.200000±n/a nM
Citation
 Nagasawa, JGovek, SKahraman, MLai, ABonnefous, CDouglas, KSensintaffar, JLu, NLee, KAparicio, AKaufman, JQian, JShao, GPrudente, RJoseph, JDDarimont, BBrigham, DMaheu, KHeyman, RRix, PJHager, JHSmith, ND Identification of an Orally Bioavailable Chromene-Based Selective Estrogen Receptor Degrader (SERD) That Demonstrates Robust Activity in a Model of Tamoxifen-Resistant Breast Cancer. J Med Chem 61:7917-7928 (2018)  
Target
Name:
Estrogen receptor
Synonyms:
ER ESR ESR1_HUMAN Estrogen receptor Estrogen receptor (ER-alpha) Estrogen receptor alpha (ER) Nuclear receptor subfamily 3 group A member 1
Type:
Protein
Mol. Mass.:
66230.44
Organism:
Homo sapiens (Human)
Description:
P03372
Residue:
595
  
Inhibitor
Name:
BDBM50368804
Synonyms:
CHEMBL4163162
Type:
Small organic molecule
Emp. Form.:
C29H31NO4
Mol. Mass.:
457.5607
SMILES:
CC1=C(C(Oc2ccc(O)cc12)c1ccc(OCCN2CCCCC2)cc1)c1cccc(O)c1
: