Target
Estrogen receptor
Ligand
BDBM50368873
Substrate
Meas. Tech.
ChEMBL_1736208 (CHEMBL4151744)
IC50
0.200000±n/a nM
Citation
 Nagasawa, JGovek, SKahraman, MLai, ABonnefous, CDouglas, KSensintaffar, JLu, NLee, KAparicio, AKaufman, JQian, JShao, GPrudente, RJoseph, JDDarimont, BBrigham, DMaheu, KHeyman, RRix, PJHager, JHSmith, ND Identification of an Orally Bioavailable Chromene-Based Selective Estrogen Receptor Degrader (SERD) That Demonstrates Robust Activity in a Model of Tamoxifen-Resistant Breast Cancer. J Med Chem 61:7917-7928 (2018)  
Target
Name:
Estrogen receptor
Synonyms:
ER ESR ESR1_HUMAN Estrogen receptor Estrogen receptor (ER-alpha) Estrogen receptor alpha (ER) Nuclear receptor subfamily 3 group A member 1
Type:
Protein
Mol. Mass.:
66230.44
Organism:
Homo sapiens (Human)
Description:
P03372
Residue:
595
  
Inhibitor
Name:
BDBM50368873
Synonyms:
CHEMBL4164447
Type:
Small organic molecule
Emp. Form.:
C31H35NO4
Mol. Mass.:
485.6139
SMILES:
C[C@@H](COc1ccc(cc1)C1Oc2ccc(O)cc2C(C)=C1c1cccc(O)c1)N1CCCCCC1
: