Target
Folylpolyglutamate synthase, mitochondrial
Ligand
BDBM50002472
Substrate
Meas. Tech.
ChEBML_68383
Ki
8.3±n/a nM
Citation
 Patil, SAShane, BFreisheim, JHSingh, SKHynes, JB Inhibition of mammalian folylpolyglutamate synthetase and human dihydrofolate reductase by 5,8-dideaza analogues of folic acid and aminopterin bearing a terminal L-ornithine. J Med Chem 32:1559-65 (1989)  
Target
Name:
Folylpolyglutamate synthase, mitochondrial
Synonyms:
FOLC_HUMAN Folylpoly-gamma-glutamate synthetase Tetrahydrofolate synthase | Tetrahydrofolylpolyglutamate synthase
Type:
PROTEIN
Mol. Mass.:
64621.95
Organism:
Homo sapiens (Human)
Description:
ChEMBL_68676
Residue:
587
  
Inhibitor
Name:
BDBM50002472
Synonyms:
5-Amino-2-{4-[(2-amino-5-chloro-4-oxo-3,4-dihydro-quinazolin-6-ylmethyl)-amino]-benzoylamino}-pentanoic acid | CHEMBL288142
Type:
Small organic molecule
Emp. Form.:
C21H23ClN6O4
Mol. Mass.:
458.898
SMILES:
NCCCC(NC(=O)c1ccc(NCc2ccc3nc(N)[nH]c(=O)c3c2Cl)cc1)C(O)=O
: