Target
N-arachidonyl glycine receptor
Ligand
BDBM50449589
Substrate
Meas. Tech.
ChEMBL_1740199 (CHEMBL4155949)
IC50
>10000±n/a nM
Citation
 Schoeder, CTKaleta, MMahardhika, ABOlejarz-Maciej, A?a?ewska, DKie?-Kononowicz, KMüller, CE Structure-activity relationships of imidazothiazinones and analogs as antagonists of the cannabinoid-activated orphan G protein-coupled receptor GPR18. Eur J Med Chem 155:381-397 (2018)  
Target
Name:
N-arachidonyl glycine receptor
Synonyms:
G-protein coupled receptor 18 GPR18 NAGly receptor
Type:
PROTEIN
Mol. Mass.:
38150.44
Organism:
Homo sapiens (Human)
Description:
ChEMBL_107601
Residue:
331
  
Inhibitor
Name:
BDBM50449589
Synonyms:
CHEMBL4173561
Type:
Small organic molecule
Emp. Form.:
C17H12ClNO2S2
Mol. Mass.:
361.866
SMILES:
Clc1ccc(COc2cccc(\C=C3/SC(=S)NC3=O)c2)cc1
: