Target
Urease subunit beta
Ligand
BDBM50449763
Substrate
Meas. Tech.
ChEMBL_1740617 (CHEMBL4156367)
Ki
314±n/a nM
Citation
 Liu, QShi, WKRen, SZNi, WWLi, WYChen, HMLiu, PYuan, JHe, XSLiu, JJCao, PYang, PZXiao, ZPZhu, HL Arylamino containing hydroxamic acids as potent urease inhibitors for the treatment of Helicobacter pylori infection. Eur J Med Chem 156:126-136 (2018)  
Target
Name:
Urease subunit beta
Synonyms:
3.5.1.5 Urea amidohydrolase subunit beta hpuB | ureB
Type:
PROTEIN
Mol. Mass.:
61676.43
Organism:
Helicobacter pylori (strain ATCC 700392 / 26695) (Campylobacterpylori)
Description:
ChEMBL_117195
Residue:
569
  
Inhibitor
Name:
BDBM50449763
Synonyms:
CHEMBL4176964
Type:
Small organic molecule
Emp. Form.:
C8H8Cl2N2O2
Mol. Mass.:
235.067
SMILES:
ONC(=O)CNc1cc(Cl)cc(Cl)c1
: