Target
Carbonic anhydrase 3
Ligand
BDBM50449830
Substrate
Meas. Tech.
ChEMBL_1740745 (CHEMBL4156495)
Kd
100000±n/a nM
Citation
 Zak?auskas, A?apkauskait?, EJezep?ikas, LLinkuvien?, VKi?onait?, MSmirnov, AManakova, EGra?ulis, SMatulis, D Design of two-tail compounds with rotationally fixed benzenesulfonamide ring as inhibitors of carbonic anhydrases. Eur J Med Chem 156:61-78 (2018)  
Target
Name:
Carbonic anhydrase 3
Synonyms:
CA-III CAH3_HUMAN Carbonic Anhydrase III Carbonic anhydrase 3 (CA III) | Carbonic anhydrase III (CA III)
Type:
Enzyme
Mol. Mass.:
29562.11
Organism:
Homo sapiens (Human)
Description:
Human cloned isozyme.
Residue:
260
  
Inhibitor
Name:
BDBM50449830
Synonyms:
CHEMBL4173814
Type:
Small organic molecule
Emp. Form.:
C11H12Cl2N2O4S
Mol. Mass.:
339.195
SMILES:
NS(=O)(=O)c1cc(C(=O)N2CCOCC2)c(Cl)cc1Cl
: