Target
Carbonic anhydrase 6
Ligand
BDBM50449832
Substrate
Meas. Tech.
ChEMBL_1740749 (CHEMBL4156499)
Kd
25000±n/a nM
Citation
 Zak?auskas, A?apkauskait?, EJezep?ikas, LLinkuvien?, VKi?onait?, MSmirnov, AManakova, EGra?ulis, SMatulis, D Design of two-tail compounds with rotationally fixed benzenesulfonamide ring as inhibitors of carbonic anhydrases. Eur J Med Chem 156:61-78 (2018)  
Target
Name:
Carbonic anhydrase 6
Synonyms:
CA-VI CAH6_HUMAN Carbonic Anhydrase VI Carbonic anhydrase 6 Carbonic anhydrase 6 (CA-VI) Salivary carbonic anhydrase | Secreted carbonic anhydrase
Type:
Enzyme
Mol. Mass.:
35371.40
Organism:
Homo sapiens (Human)
Description:
P23280
Residue:
308
  
Inhibitor
Name:
BDBM50449832
Synonyms:
CHEMBL4165543
Type:
Small organic molecule
Emp. Form.:
C16H24ClN3O4S
Mol. Mass.:
389.897
SMILES:
NS(=O)(=O)c1cc(C(=O)NCCCO)c(NC2CCCCC2)cc1Cl
: