Target
Carbonic anhydrase 3
Ligand
BDBM50449811
Substrate
Meas. Tech.
ChEMBL_1740745 (CHEMBL4156495)
Kd
13900±n/a nM
Citation
 Zak?auskas, A?apkauskait?, EJezep?ikas, LLinkuvien?, VKi?onait?, MSmirnov, AManakova, EGra?ulis, SMatulis, D Design of two-tail compounds with rotationally fixed benzenesulfonamide ring as inhibitors of carbonic anhydrases. Eur J Med Chem 156:61-78 (2018)  
Target
Name:
Carbonic anhydrase 3
Synonyms:
CA-III CAH3_HUMAN Carbonic Anhydrase III Carbonic anhydrase 3 (CA III) | Carbonic anhydrase III (CA III)
Type:
Enzyme
Mol. Mass.:
29562.11
Organism:
Homo sapiens (Human)
Description:
Human cloned isozyme.
Residue:
260
  
Inhibitor
Name:
BDBM50449811
Synonyms:
CHEMBL4165127
Type:
Small organic molecule
Emp. Form.:
C7H5Br2NO4S
Mol. Mass.:
358.992
SMILES:
NS(=O)(=O)c1cc(C(O)=O)c(Br)cc1Br
: