Target
Alpha-1A adrenergic receptor
Ligand
BDBM50018740
Substrate
Meas. Tech.
ChEBML_33091
Ki
2800±n/a nM
Citation
 Huff, JRBaldwin, JJdeSolms, SJGuare, JPHunt, CARandall, WCSanders, WSSmith, SJVacca, JPZrada, MM Structure-affinity relationships of arylquinolizines at alpha-adrenoceptors. J Med Chem 31:641-5 (1988)  
Target
Name:
Alpha-1A adrenergic receptor
Synonyms:
ADA1A_BOVIN ADRA1C Alpha 1A-adrenoreceptor Cerebral cortex alpha adrenergic receptor | adrenergic Alpha1
Type:
Enzyme Catalytic Domain
Mol. Mass.:
51492.08
Organism:
CALF
Description:
adrenergic Alpha1 0 CALF
Residue:
466
  
Inhibitor
Name:
BDBM50018740
Synonyms:
4,7,8,9,10,10a-Hexahydro-5H-thiazolo[4,5-a]quinolizin-2-ylamine | CHEMBL160388
Type:
Small organic molecule
Emp. Form.:
C10H15N3S
Mol. Mass.:
209.311
SMILES:
Nc1nc2C3CCCCN3CCc2s1
: