Target
Alpha-2A adrenergic receptor
Ligand
BDBM50018735
Substrate
Meas. Tech.
ChEMBL_33030 (CHEMBL643955)
Ki
2000±n/a nM
Citation
 Huff, JRBaldwin, JJdeSolms, SJGuare, JPHunt, CARandall, WCSanders, WSSmith, SJVacca, JPZrada, MM Structure-affinity relationships of arylquinolizines at alpha-adrenoceptors. J Med Chem 31:641-5 (1988)  
Target
Name:
Alpha-2A adrenergic receptor
Synonyms:
ADA2A_BOVIN Alpha-2A adrenergic receptor Alpha-2A adrenoreceptor Alpha-2D adrenergic receptor Cerebral cortex alpha adrenergic receptor adrenergic Alpha2D
Type:
Enzyme Catalytic Domain
Mol. Mass.:
49275.13
Organism:
BOVINE
Description:
adrenergic Alpha2 0 BOVINE::Q28838
Residue:
452
  
Inhibitor
Name:
BDBM50018735
Synonyms:
5,6,7,8,9,10-Hexahydro-4bH-4,8a-diaza-phenanthrene | CHEMBL348538
Type:
Small organic molecule
Emp. Form.:
C12H16N2
Mol. Mass.:
188.2688
SMILES:
C1CCN2CCc3cccnc3C2C1
: