Target
Lanosterol synthase
Ligand
BDBM32203
Substrate
Meas. Tech.
ChEMBL_1742619 (CHEMBL4158369)
IC50
3162±n/a nM
Citation
 Buchler, IAkuma, DAu, VCarr, Gde León, PDePasquale, MErnst, GHuang, YKimos, MKolobova, APoslusney, MWei, HSwinnen, DMontel, FMoureau, FJigorel, ESchulze, MEDWood, MBarrow, JC Optimization of 8-Hydroxyquinolines as Inhibitors of Catechol O-Methyltransferase. J Med Chem 61:9647-9665 (2018)  
Target
Name:
Lanosterol synthase
Synonyms:
LSS_RAT Osc
Type:
PROTEIN
Mol. Mass.:
83302.12
Organism:
Rattus norvegicus
Description:
ChEMBL_12083
Residue:
733
  
Inhibitor
Name:
BDBM32203
Synonyms:
8-quinolinol US10005735, Table 1.7 cid_1923 quinolin-8-ol
Type:
Small organic molecule
Emp. Form.:
C9H7NO
Mol. Mass.:
145.158
SMILES:
Oc1cccc2cccnc12
: