Target
Tyrosyl-DNA phosphodiesterase 1
Ligand
BDBM50450515
Substrate
Meas. Tech.
ChEMBL_1742721 (CHEMBL4158471)
IC50
16000±n/a nM
Citation
 Zhang, XRWang, HWTang, WLZhang, YYang, HHu, DXRavji, AMarchand, CKiselev, EOfori-Atta, KAgama, KPommier, YAn, LK Discovery, Synthesis, and Evaluation of Oxynitidine Derivatives as Dual Inhibitors of DNA Topoisomerase IB (TOP1) and Tyrosyl-DNA Phosphodiesterase 1 (TDP1), and Potential Antitumor Agents. J Med Chem 61:9908-9930 (2018)  
Target
Name:
Tyrosyl-DNA phosphodiesterase 1
Synonyms:
TDP1 Tyrosyl-DNA phosphodiesterase 1 | Tyrosyl-DNA phosphodiesterase 1 (TDP1)
Type:
Enzyme
Mol. Mass.:
68430.66
Organism:
Homo sapiens (Human)
Description:
Q9NUW8
Residue:
608
  
Inhibitor
Name:
BDBM50450515
Synonyms:
CHEMBL4175525
Type:
Small organic molecule
Emp. Form.:
C24H24N2O5
Mol. Mass.:
420.4578
SMILES:
COc1cc2c(OCCN(C)C)nc3c(ccc4cc5OCOc5cc34)c2cc1OC
: