Target
Tyrosyl-DNA phosphodiesterase 1
Ligand
BDBM50450519
Substrate
Meas. Tech.
ChEMBL_1742720 (CHEMBL4158470)
IC50
15000±n/a nM
Citation
 Zhang, XRWang, HWTang, WLZhang, YYang, HHu, DXRavji, AMarchand, CKiselev, EOfori-Atta, KAgama, KPommier, YAn, LK Discovery, Synthesis, and Evaluation of Oxynitidine Derivatives as Dual Inhibitors of DNA Topoisomerase IB (TOP1) and Tyrosyl-DNA Phosphodiesterase 1 (TDP1), and Potential Antitumor Agents. J Med Chem 61:9908-9930 (2018)  
Target
Name:
Tyrosyl-DNA phosphodiesterase 1
Synonyms:
TDP1 Tyrosyl-DNA phosphodiesterase 1 | Tyrosyl-DNA phosphodiesterase 1 (TDP1)
Type:
Enzyme
Mol. Mass.:
68430.66
Organism:
Homo sapiens (Human)
Description:
Q9NUW8
Residue:
608
  
Inhibitor
Name:
BDBM50450519
Synonyms:
CHEMBL4174471
Type:
Small organic molecule
Emp. Form.:
C27H30N2O5
Mol. Mass.:
462.5375
SMILES:
CCN(CC)CCCOc1nc2c3cc4OCOc4cc3ccc2c2cc(OC)c(OC)cc12
: