Target
Tyrosyl-DNA phosphodiesterase 1
Ligand
BDBM50450520
Substrate
Meas. Tech.
ChEMBL_1742720 (CHEMBL4158470)
IC50
20000±n/a nM
Citation
 Zhang, XRWang, HWTang, WLZhang, YYang, HHu, DXRavji, AMarchand, CKiselev, EOfori-Atta, KAgama, KPommier, YAn, LK Discovery, Synthesis, and Evaluation of Oxynitidine Derivatives as Dual Inhibitors of DNA Topoisomerase IB (TOP1) and Tyrosyl-DNA Phosphodiesterase 1 (TDP1), and Potential Antitumor Agents. J Med Chem 61:9908-9930 (2018)  
Target
Name:
Tyrosyl-DNA phosphodiesterase 1
Synonyms:
TDP1 Tyrosyl-DNA phosphodiesterase 1 | Tyrosyl-DNA phosphodiesterase 1 (TDP1)
Type:
Enzyme
Mol. Mass.:
68430.66
Organism:
Homo sapiens (Human)
Description:
Q9NUW8
Residue:
608
  
Inhibitor
Name:
BDBM50450520
Synonyms:
CHEMBL4169150
Type:
Small organic molecule
Emp. Form.:
C27H28N2O5
Mol. Mass.:
460.5216
SMILES:
COc1cc2c(OCCCN3CCCC3)nc3c4cc5OCOc5cc4ccc3c2cc1OC
: