Target
Proteasome subunit beta type-5
Ligand
BDBM50439674
Substrate
Meas. Tech.
ChEMBL_1743176 (CHEMBL4158926)
IC50
>25000±n/a nM
Citation
 Bhatia, SKrieger, VGroll, MOsko, JDReßing, NAhlert, HBorkhardt, AKurz, TChristianson, DWHauer, JHansen, FK Discovery of the First-in-Class Dual Histone Deacetylase-Proteasome Inhibitor. J Med Chem 61:10299-10309 (2018)  
Target
Name:
Proteasome subunit beta type-5
Synonyms:
20S proteasome chymotrypsin-like LMPX PSB5_HUMAN Proteasome Macropain subunit MB1 X
Type:
Protein
Mol. Mass.:
28480.96
Organism:
Homo sapiens (Human)
Description:
Residue:
263
  
Inhibitor
Name:
BDBM50439674
Synonyms:
RICOLINOSTAT US11207431, Example E US8609678, 2-(diphenylamino)-N-(7-(hydroxyamino)-7-oxoheptyl)pyrimidine-5-carboxamide [26]
Type:
Small organic molecule
Emp. Form.:
C24H27N5O3
Mol. Mass.:
433.5029
SMILES:
ONC(=O)CCCCCCNC(=O)c1cnc(nc1)N(c1ccccc1)c1ccccc1
: