Target
Capsid protein
Ligand
BDBM50247801
Substrate
Meas. Tech.
ChEMBL_1743345 (CHEMBL4177855)
EC50
42±n/a nM
Citation
 Ren, QLiu, XLuo, ZLi, JWang, CGoldmann, SZhang, JZhang, Y Discovery of hepatitis B virus capsid assembly inhibitors leading to a heteroaryldihydropyrimidine based clinical candidate (GLS4). Bioorg Med Chem 25:1042-1056 (2017)  
Target
Name:
Capsid protein
Synonyms:
Core antigen
Type:
PROTEIN
Mol. Mass.:
26278.39
Organism:
Hepatitis B virus
Description:
ChEMBL_450484
Residue:
230
  
Inhibitor
Name:
BDBM50247801
Synonyms:
CHEMBL4070728
Type:
Small organic molecule
Emp. Form.:
C23H24BrFN4O3
Mol. Mass.:
503.364
SMILES:
CCOC(=O)C1=C(CN2CCOCC2)NC(=NC1c1ccc(F)cc1Br)c1ccccn1
: