Target
Capsid protein
Ligand
BDBM50247812
Substrate
Meas. Tech.
ChEMBL_1743459 (CHEMBL4177969)
EC50
39±n/a nM
Citation
 Ren, QLiu, XLuo, ZLi, JWang, CGoldmann, SZhang, JZhang, Y Discovery of hepatitis B virus capsid assembly inhibitors leading to a heteroaryldihydropyrimidine based clinical candidate (GLS4). Bioorg Med Chem 25:1042-1056 (2017)  
Target
Name:
Capsid protein
Synonyms:
Core antigen
Type:
PROTEIN
Mol. Mass.:
26278.39
Organism:
Hepatitis B virus
Description:
ChEMBL_450484
Residue:
230
  
Inhibitor
Name:
BDBM50247812
Synonyms:
CHEMBL3742114
Type:
Small organic molecule
Emp. Form.:
C21H22BrFN4O3S
Mol. Mass.:
509.392
SMILES:
CCOC(=O)C1=C(CN2CCOCC2)NC(=NC1c1ccc(F)cc1Br)c1nccs1
: