Target
G-protein coupled receptor 4
Ligand
BDBM123510
Substrate
Meas. Tech.
ChEMBL_1744231 (CHEMBL4178741)
IC50
70±n/a nM
Citation
 Velcicky, JMiltz, WOberhauser, BOrain, DVaupel, AWeigand, KDawson King, JLittlewood-Evans, ANash, MFeifel, RLoetscher, P Development of Selective, Orally Active GPR4 Antagonists with Modulatory Effects on Nociception, Inflammation, and Angiogenesis. J Med Chem 60:3672-3683 (2017)  
Target
Name:
G-protein coupled receptor 4
Synonyms:
G-protein coupled receptor 4 GPR4 | GPR4_HUMAN
Type:
Enzyme
Mol. Mass.:
40994.40
Organism:
Homo sapiens (Human)
Description:
P46093
Residue:
362
  
Inhibitor
Name:
BDBM123510
Synonyms:
US8748435, 35
Type:
Small organic molecule
Emp. Form.:
C24H28N6O
Mol. Mass.:
416.5187
SMILES:
CCc1nn2c(C)cc(C)nc2c1Cc1ccc(cc1)-c1nnc(o1)C1CCNCC1
: