Target
Sodium channel protein type 1 subunit alpha
Ligand
BDBM50451447
Substrate
Meas. Tech.
ChEMBL_1745262 (CHEMBL4179772)
IC50
309±n/a nM
Citation
Target
Name:
Sodium channel protein type 1 subunit alpha
Synonyms:
NAC1 SCN1A Sodium (Site 1) Sodium channel protein type 1 subunit alpha Sodium channel protein type I subunit alpha Voltage-gated sodium channel subunit alpha Nav1.1
Type:
Protein
Mol. Mass.:
228952.47
Organism:
Homo sapiens (Human)
Description:
P35498
Residue:
2009
  
Inhibitor
Name:
BDBM50451447
Synonyms:
CHEMBL4217988
Type:
Small organic molecule
Emp. Form.:
C35H32F3N7O3S2
Mol. Mass.:
719.799
SMILES:
FC(F)(F)c1cccc(c1)-c1ccc(Oc2ccc(cc2C#N)S(=O)(=O)Nc2ncns2)c(c1)-c1ccnc(CNCCC2CCNCC2)c1
: