Target
Sodium channel protein type 3 subunit alpha
Ligand
BDBM50451447
Substrate
Meas. Tech.
ChEMBL_1745264 (CHEMBL4179774)
IC50
6438±n/a nM
Citation
Target
Name:
Sodium channel protein type 3 subunit alpha
Synonyms:
KIAA1356 NAC3 SCN3A_HUMAN Sodium channel alpha subunits; brain (Types I, II, III) Voltage-gated sodium channel subunit alpha Nav1.3 (Nav1.3)
Type:
Protein
Mol. Mass.:
226276.42
Organism:
Homo sapiens (Human)
Description:
Q9NY46
Residue:
2000
  
Inhibitor
Name:
BDBM50451447
Synonyms:
CHEMBL4217988
Type:
Small organic molecule
Emp. Form.:
C35H32F3N7O3S2
Mol. Mass.:
719.799
SMILES:
FC(F)(F)c1cccc(c1)-c1ccc(Oc2ccc(cc2C#N)S(=O)(=O)Nc2ncns2)c(c1)-c1ccnc(CNCCC2CCNCC2)c1
: