Target
Neuronal acetylcholine receptor subunit alpha-7
Ligand
BDBM50451612
Substrate
Meas. Tech.
ChEMBL_1745955 (CHEMBL4180465)
EC50
11±n/a nM
Citation
 Cook, JZusi, FCHill, MDFang, HPearce, BPark, HGallagher, LMcDonald, IMBristow, LMacor, JEOlson, RE Design and synthesis of a novel series of (1'S,2R,4'S)-3H-4'-azaspiro[benzo[4,5]imidazo[2,1-b]oxazole-2,2'-bicyclo[2.2.2]octanes] with high affinity for the ?7 neuronal nicotinic receptor. Bioorg Med Chem Lett 27:5002-5005 (2017)  
Target
Name:
Neuronal acetylcholine receptor subunit alpha-7
Synonyms:
ACHA7_RAT Cholinergic, Nicotinic Alpha7 Chrna7 Neuronal acetylcholine receptor (alpha7 nAChR) Neuronal acetylcholine receptor subunit alpha-7 Neuronal acetylcholine receptor subunit alpha-7 (nAChR)
Type:
Enzyme
Mol. Mass.:
56502.44
Organism:
Rattus norvegicus (Rat)
Description:
Q05941
Residue:
502
  
Inhibitor
Name:
BDBM50451612
Synonyms:
CHEMBL4215131
Type:
Small organic molecule
Emp. Form.:
C15H17N3O
Mol. Mass.:
255.315
SMILES:
C1n2c(O[C@]11CN3CCC1CC3)nc1ccccc21
: