Target
Alpha-galactosidase
Ligand
BDBM50451726
Substrate
Meas. Tech.
ChEMBL_1746127 (CHEMBL4180637)
IC50
54640±n/a nM
Citation
 Lawande, PPSontakke, VAKumbhar, NMBhagwat, TRGhosh, SShinde, VS Polyhydroxylated azetidine iminosugars: Synthesis, glycosidase inhibitory activity and molecular docking studies. Bioorg Med Chem Lett 27:5291-5295 (2017)  
Target
Name:
Alpha-galactosidase
Synonyms:
3.2.1.22 Melibiase rafA
Type:
PROTEIN
Mol. Mass.:
81189.95
Organism:
Escherichia coli
Description:
ChEMBL_117964
Residue:
708
  
Inhibitor
Name:
BDBM50451726
Synonyms:
CHEMBL4215543
Type:
Small organic molecule
Emp. Form.:
C6H13NO4
Mol. Mass.:
163.1717
SMILES:
[H][C@@]1(N[C@@H](CO)[C@H]1O)[C@@H](O)CO
: