Target
Cytochrome P450 3A4
Ligand
BDBM50063995
Substrate
Meas. Tech.
ChEMBL_1747140 (CHEMBL4181650)
IC50
>50000±n/a nM
Citation
 Choi, PJSutherland, HSTong, ASTBlaser, AFranzblau, SGCooper, CBLotlikar, MUUpton, AMGuillemont, JMotte, MQueguiner, LAndries, KVan den Broeck, WDenny, WAPalmer, BD Synthesis and evaluation of analogues of the tuberculosis drug bedaquiline containing heterocyclic B-ring units. Bioorg Med Chem Lett 27:5190-5196 (2017)  
Target
Name:
Cytochrome P450 3A4
Synonyms:
Albendazole monooxygenase CP3A4_HUMAN CYP3A4 CYPIIIA4 Cytochrome P450 3A4 (CYP3A4) Nifedipine oxidase Taurochenodeoxycholate 6-alpha-hydroxylase
Type:
Enzyme
Mol. Mass.:
57349.57
Organism:
Homo sapiens (Human)
Description:
Residue:
503
  
Inhibitor
Name:
BDBM50063995
Synonyms:
Bedaquiline TMC207
Type:
Small organic molecule
Emp. Form.:
C32H31BrN2O2
Mol. Mass.:
555.505
SMILES:
COc1nc2ccc(Br)cc2cc1[C@@H](c1ccccc1)[C@@](O)(CCN(C)C)c1cccc2ccccc12
: