Target
Bifunctional dihydrofolate reductase-thymidylate synthase
Ligand
BDBM50035483
Substrate
Meas. Tech.
ChEMBL_1747167 (CHEMBL4181677)
IC50
0.390000±n/a nM
Citation
 Chen, WHuang, ZWang, WMao, FGuan, LTang, YJiang, HLi, JHuang, JJiang, LZhu, J Discovery of new antimalarial agents: Second-generation dual inhibitors against FP-2 and PfDHFR via fragments assembely. Bioorg Med Chem 25:6467-6478 (2017)  
Target
Name:
Bifunctional dihydrofolate reductase-thymidylate synthase
Synonyms:
DHFR-TS Dihydrofolate Reductase-Thymidylate Synthase (DHFR-TS) Mutant KICB1 PfDHFR-TS double mutant (C59R+S108N)
Type:
Enzyme
Mol. Mass.:
71822.51
Organism:
Plasmodium falciparum (isolate K1 / Thailand)
Description:
The mutant clone was prepared by cassette mutagenesis using wildtype pfDHFR as a template, and expressed in E. coli.
Residue:
608
  
Inhibitor
Name:
BDBM50035483
Synonyms:
5-Chloro-N*6*-(2,5-dimethoxy-benzyl)-quinazoline-2,4,6-triamine 5-chloro-N~6~-(2,5-dimethoxybenzyl)quinazoline-2,4,6-triamine | CHEMBL138060
Type:
Small organic molecule
Emp. Form.:
C17H18ClN5O2
Mol. Mass.:
359.81
SMILES:
COc1ccc(OC)c(CNc2ccc3nc(N)nc(N)c3c2Cl)c1
: