Target
Voltage-dependent T-type calcium channel subunit alpha-1G
Ligand
BDBM50452233
Substrate
Meas. Tech.
ChEMBL_1747209 (CHEMBL4181719)
IC50
1.3±n/a nM
Citation
 Bezençon, OHeidmann, BSiegrist, RStamm, SRichard, SPozzi, DCorminboeuf, ORoch, CKessler, MErtel, EAReymond, IPfeifer, Tde Kanter, RToeroek-Schafroth, MMoccia, LGMawet, JMoon, RRey, MCapeleto, BFournier, E Discovery of a Potent, Selective T-type Calcium Channel Blocker as a Drug Candidate for the Treatment of Generalized Epilepsies. J Med Chem 60:9769-9789 (2017)  
Target
Name:
Voltage-dependent T-type calcium channel subunit alpha-1G
Synonyms:
CAC1G_HUMAN KIAA1123 Voltage-gated T-type calcium channel alpha-1G subunit
Type:
PROTEIN
Mol. Mass.:
262471.14
Organism:
Homo sapiens (Human)
Description:
ChEMBL_1515216
Residue:
2377
  
Inhibitor
Name:
BDBM50452233
Synonyms:
CHEMBL4203101
Type:
Small organic molecule
Emp. Form.:
C23H22F2N4O2
Mol. Mass.:
424.4432
SMILES:
CN1C(=O)C(C)(C)c2cc(CC(=O)Nc3ccn(Cc4ccc(F)c(F)c4)n3)ccc12
: