Target
Muscarinic acetylcholine receptor M1
Ligand
BDBM50452411
Substrate
Meas. Tech.
ChEMBL_1747515 (CHEMBL4182025)
EC50
1469±n/a nM
Citation
 Flohr, AHutter, RMueller, BBohnert, CPellisson, MSchaffhauser, H Discovery of the first low-shift positive allosteric modulators for the muscarinic M1 receptor. Bioorg Med Chem Lett 27:5415-5419 (2017)  
Target
Name:
Muscarinic acetylcholine receptor M1
Synonyms:
ACM1_HUMAN Cholinergic receptor, muscarinic 1 | Cholinergic, muscarinic M1
Type:
Protein
Mol. Mass.:
51442.54
Organism:
Homo sapiens (Human)
Description:
P11229
Residue:
460
  
Inhibitor
Name:
BDBM50452411
Synonyms:
CHEMBL4217684
Type:
Small organic molecule
Emp. Form.:
C24H22N2S
Mol. Mass.:
370.51
SMILES:
CC(C)[C@@H]1N=C(c2ccccc2)c2cc(ccc2NC1=S)-c1ccccc1
: