Target
Muscarinic acetylcholine receptor M1
Ligand
BDBM50452421
Substrate
Meas. Tech.
ChEMBL_1747515 (CHEMBL4182025)
EC50
172±n/a nM
Citation
 Flohr, AHutter, RMueller, BBohnert, CPellisson, MSchaffhauser, H Discovery of the first low-shift positive allosteric modulators for the muscarinic M1 receptor. Bioorg Med Chem Lett 27:5415-5419 (2017)  
Target
Name:
Muscarinic acetylcholine receptor M1
Synonyms:
ACM1_HUMAN Cholinergic receptor, muscarinic 1 | Cholinergic, muscarinic M1
Type:
Protein
Mol. Mass.:
51442.54
Organism:
Homo sapiens (Human)
Description:
P11229
Residue:
460
  
Inhibitor
Name:
BDBM50452421
Synonyms:
CHEMBL4212268
Type:
Small organic molecule
Emp. Form.:
C18H16Cl2N2S
Mol. Mass.:
363.304
SMILES:
CC(C)[C@@H]1N=C(c2cccc(Cl)c2)c2cc(Cl)ccc2NC1=S
: