Target
Genome polyprotein
Ligand
BDBM50198324
Substrate
Meas. Tech.
ChEMBL_1747697 (CHEMBL4182207)
EC50
4.5±n/a nM
Citation
 Bowsher, MHiebert, SLi, RWang, AXFriborg, JYu, FHernandez, DWang, YKKlei, HRajamani, RMosure, KKnipe, JOMeanwell, NAMcPhee, FScola, PM The discovery and optimization of naphthalene-linked P2-P4 Macrocycles as inhibitors of HCV NS3 protease. Bioorg Med Chem Lett 28:43-48 (2018)  
Target
Name:
Genome polyprotein
Synonyms:
Hepatitis C virus NS3 protease/helicase | Hepatitis C virus serine protease, NS3/NS4A
Type:
Protein
Mol. Mass.:
67067.41
Organism:
Hepatitis C virus
Description:
A3EZI9
Residue:
631
  
Inhibitor
Name:
BDBM50198324
Synonyms:
CHEMBL3933212
Type:
Small organic molecule
Emp. Form.:
C37H45ClF3N5O9S
Mol. Mass.:
828.295
SMILES:
COc1cnc(O[C@@H]2C[C@H](N(C2)C(=O)[C@@H](NC(=O)O[C@H](C)C(F)(F)F)C2CCCCC2)C(=O)N[C@@]2(C[C@H]2C2CC2)C(=O)NS(=O)(=O)C2CC2)c2cc(Cl)ccc12
: